{"text_format":"1","workbook":"xlsx","n_sheets":16,"sheets":["Guidance","Process Map","Wholesale Tariff","Water Avoidable Costs","Sewerage Avoidable Costs","Long Run Avoidable Costs","Asset lives","York tariffs","Bidding Costs","Wholesale charges","Scientific services","Metering costs","Water costs","Leakage costs","Wastewater costs","Business overhead"],"not_rendered":{"charts":1,"images":28,"macros":1,"external_links":0,"defined_names":1,"comments":6,"pivot_tables":0},"unopened":[],"bounds":{"document_bytes":16777216,"sheet_cells":100000,"rows_first":2000,"rows_last":500,"rows_between":2000,"halvings":0,"cell_chars":16384,"cell_head_chars":4096},"cells_cut":0,"cells_raw":0,"read":"whole","date_system":"1900"}

{"sheet":"Guidance","index":0,"n_rows":0,"n_cols":0,"rows_kept":0,"cut":false,"hidden":false,"merged":[]}

{"sheet":"Process Map","index":1,"n_rows":0,"n_cols":0,"rows_kept":0,"cut":false,"hidden":false,"merged":[]}

{"sheet":"Wholesale Tariff","index":2,"n_rows":87,"n_cols":16,"rows_kept":87,"cut":false,"hidden":false,"merged":[[86,6,86,7],[86,3,86,5],[85,3,85,5],[67,6,67,7],[76,6,76,7],[68,6,68,7],[77,6,77,7],[69,6,69,7],[78,6,78,7],[78,3,78,5],[67,3,67,5],[68,3,68,5],[69,3,69,5],[76,3,76,5],[77,3,77,5],[1,1,1,13],[85,6,85,7],[70,3,70,5],[71,3,71,5],[72,3,72,5],[70,6,70,7],[71,6,71,7],[72,6,72,7],[79,3,79,5],[80,3,80,5],[81,3,81,5],[79,6,79,7],[80,6,80,7],[81,6,81,7]]}
[]
[null,"Household and NonHousehold Wholesale Tariff"]
[null,null,null,null,null,null,null,null,null,null,null,null,null,null,"Colour codes:","user input values"]
[null,1,"NAV applicant details",null,null,null,null,null,null,null,null,null,null,null,null,"calculated values"]
[null,null,"Contact Name"]
[null,null,"Company"]
[null,null,"Address"]
[]
[]
[null,null,"Postcode"]
[null,null,"Telephone Number"]
[null,null,"Email"]
[]
[]
[null,2,"Development location details"]
[null,null,"Site address"]
[null,null,"Postcode"]
[]
[]
[null,null,"Is the site within the York area?*","No"]
{"$rows_left_out":68}
{"sheet":"Water Avoidable Costs","index":3,"n_rows":24,"n_cols":19,"rows_kept":24,"cut":false,"hidden":false,"merged":[[22,5,22,15],[19,5,19,15],[0,1,0,16],[11,5,11,15],[12,5,12,15],[13,5,13,15],[5,5,5,15],[2,5,2,15],[16,5,16,15],[4,5,4,15],[9,5,9,15],[10,5,10,15],[3,5,3,15]]}
[null,"Avoidable Costs - Water supply"]
[null,"A","Treated Water Distribution Ongoing On-site Costs",null,null,null,null,null,null,null,null,null,null,null,null,null,null,"Colour codes:","user input values"]
[null,null,"Nr","Activity description","Cost £ /prop /year","Approach",null,null,null,null,null,null,null,null,null,null,null,null,"calculated values"]
[null,null,1,"Scientific services (sampling costs)",{"$f":"IFERROR(IF('Wholesale Tariff'!D25=\"Yes\",'Scientific services'!$F$12,\"\"),\"\")","v":0.41430673001728191},"Use of financial year 2018/19 expenditure values and total length of mains from APR 2018/19 to create a simple £ / m that can be multiplied with the estimate NAV rate m / prop."]
[null,null,2,"Water operational costs",{"$f":"IFERROR(IF('Wholesale Tariff'!D25=\"Yes\",'Water costs'!$F$25,\"\"),\"\")","v":""},"Use of year 2018/19 expenditure values and total length of mains from APR 2018/19 to create a simple £ / m that can be multiplied with the estimate NAV rate m / prop."]
[null,null,3,"Leakage management costs",{"$f":"IFERROR(IF('Wholesale Tariff'!D25=\"Yes\",'Leakage costs'!H14,\"\"),\"\")","v":""},"Use of new builds leakage expenditure  (£/property) for repair and detection for the last decade."]
[]
[]
[null,"B","Treated Water Distribution Replacement of On-site Assets"]
[null,null,"Nr","Activity description","Cost £ /prop /year","Approach"]
[null,null,1,"Communication pipes & stop taps replacement/renewal",{"$f":"IFERROR(IF('Wholesale Tariff'!D25=\"Yes\",'Long Run Avoidable Costs'!$G$17,\"\"),\"\")","v":""},"Use of replacement cost £ / property / year for 2018/19, asset life and discount rate at 3.89% to create a future annual value."]
[null,null,2,"Meter and meter chamber replacement/renewal",{"$f":"IFERROR(IF('Wholesale Tariff'!D25=\"Yes\",\n                    'Long Run Avoidable Costs'!$G$8,\"\"),\"\")","v":1.6678675645390912},"Use of replacement cost £ / property / year for 2018/19, asset life and discount rate at 3.89% to create a future annual value."]
[null,null,3,"Street furniture replacement/renewal",{"$f":"IFERROR(IF('Wholesale Tariff'!D25=\"Yes\",'Long Run Avoidable Costs'!$J$37,\"\"),\"\")","v":""},"Use of replacement cost £ / property / year for 2018/19, asset life and discount rate at 3.89% to create a future annual value."]
[null,null,4,"Water mains replacement/renewal",{"$f":"IFERROR(IF('Wholesale Tariff'!D25=\"Yes\",'Long Run Avoidable Costs'!$G$26,\"\"),\"\")","v":""},"Use of replacement cost £ / property / year for 2018/19, asset life and discount rate at 3.89% to create a future annual value."]
[]
[]
[null,"C",1,"Business overhead and profit",{"$f":"IFERROR(IF('Wholesale Tariff'!D25=\"Yes\",SUM(E4:E6,E11:E14,E23)*(1-(1-'Business overhead'!C9)), \"\"),\"\")","v":0.22974462538321866},"Estimated  based on Retail HH, Loop recharge and YKS charge values. (% is partially updated to current values)"]
[]
[]
[null,"D",1,"Leakage allowance - water (%)",{"$f":"IFERROR(IF('Wholesale Tariff'!D25=\"Yes\",'Leakage costs'!E30,\"\"),\"\")","v":""},"Estimated  based on Natural Rate of Rise for new DMAs in our region and the NAV characteristics."]
{"$rows_left_out":5}
{"sheet":"Sewerage Avoidable Costs","index":4,"n_rows":20,"n_cols":19,"rows_kept":20,"cut":false,"hidden":false,"merged":[[18,5,18,15],[15,5,15,15],[0,1,0,16],[8,5,8,15],[7,5,7,15],[12,5,12,15],[2,5,2,15],[3,5,3,15],[9,5,9,15]]}
[null,"Avoidable Costs -  Sewerage discharge"]
[null,"A","Sewer Discharge Avoidable Costs",null,null,null,null,null,null,null,null,null,null,null,null,null,null,"Colour codes:","user input values"]
[null,null,"Nr","Activity description","Cost £ /prop /year","Approach",null,null,null,null,null,null,null,null,null,null,null,null,"calculated values"]
[null,null,1,"Sewerage operational costs (combined sewers)",{"$f":"IFERROR(IF('Wholesale Tariff'!D26=\"Yes\",SUM('Wastewater costs'!$O$28:$P$28),\"\"),\"\")","v":""},"Use of year 2018/19 expenditure values and total length of combined sewers from APR 2018/19 to create a simple £ / m cost that can be multiplied with the NAV unit meter of sewers / property."]
[]
[]
[null,"B","Sewer Discharge Replacement of On-site Assets"]
[null,null,"Nr","Activity description","Cost £ /prop /year","Approach"]
[null,null,1,"Sewers replacement/renewal",{"$f":"IFERROR(IF('Wholesale Tariff'!D26=\"Yes\",'Long Run Avoidable Costs'!G43,\"\"),\"\")","v":""},"Use of replacement cost £ / property / year for 2018/19, asset life and discount rate at 3.89% to create a future annual value."]
[null,null,2,"Street furniture replacement/renewal",{"$f":"IFERROR(IF('Wholesale Tariff'!D26=\"Yes\",'Long Run Avoidable Costs'!$J$38,\"\"),\"\")","v":""},"Use of replacement cost £ / property / year for 2018/19, asset life and discount rate at 3.89% to create a future annual value."]
[]
[]
[null,"C",1,"Business overhead and profit",{"$f":"IFERROR(IF('Wholesale Tariff'!D26=\"Yes\",SUM(E4,E9:E10)*(1-(1-'Business overhead'!C9)),\"\"),\"\")","v":0},"Estimate  based on Retail HH, Loop recharge and YKS charge values. (% is partially updated to current values)"]
[]
[]
[null,"D",1,"Leakage allowance - sewerage (%)",{"$f":"IFERROR(IF('Wholesale Tariff'!D26=\"Yes\",'Leakage costs'!E30,\"\"),\"\")","v":""},"Estimated  based on Natural Rate of Rise for new DMAs in our region and the NAV characteristics."]
[]
[]
[null,"E",1,"Additional costs",{"$f":"IFERROR(IF('Wholesale Tariff'!D26=\"Yes\",'Bidding Costs'!C21,\"\"),\"\")","v":""},"Estimated based on bidding costs and the number of properties."]
[null,null,null,"TOTAL",{"$f":"SUM(E4,E9:E10,E13,E19)","v":0}]
{"$rows_left_out":1}
{"sheet":"Long Run Avoidable Costs","index":5,"n_rows":46,"n_cols":14,"rows_kept":46,"cut":false,"hidden":false,"merged":[[6,4,6,5],[6,6,6,7],[7,6,7,7],[15,6,15,7],[15,4,15,5],[0,1,0,11],[42,4,42,5],[42,6,42,7],[32,4,32,5],[32,6,32,7],[33,4,33,5],[33,6,33,7],[41,4,41,5],[41,6,41,7],[16,6,16,7],[24,4,24,5],[24,6,24,7],[25,4,25,5],[25,6,25,7],[16,4,16,5],[7,4,7,5]]}
[null,"Long Run Avoidable Costs"]
[null,null,null,null,null,"Rate",null,null,null,null,null,null,"Colour codes:","user input values"]
[null,null,null,1,"Discount Rate - WACC (as Ofwat's guidance)",3.8899999999999997E-2,null,null,null,null,null,null,null,"calculated values"]
[]
[]
[]
[null,null,null,null,"Asset Class",null,"TOTAL"]
[null,null,null,"A","Meter and Meter chamber",null,{"$f":"IFERROR(IF(AND('Wholesale Tariff'!D26=\"No\", 'Wholesale Tariff'!D25=\"No\"),\"\",SUM(J11:J12)),\"\")","v":1.6678675645390912}]
[]
[null,null,null,"Yrs","Asset","£/property","Asset Life","Rate","Annuity","Final Cost"]
[null,null,null,1,"meters only activities",{"$f":"'Metering costs'!G37","v":0.54760939533105379},{"$f":"'Asset lives'!G3","v":15},{"$f":"F3","v":3.8899999999999997E-2},{"$f":"-1*FV(H11,G11,1)","v":19.860705017658123},{"$f":"(('Metering costs'!$B$9/'Metering costs'!$E$28)*F11)/I11","v":1.1775792185796492}]
[null,null,null,2,"meters/chambers",{"$f":"'Metering costs'!G38","v":1.0630064732896927},{"$f":"'Asset lives'!G4","v":40},{"$f":"F3","v":3.8899999999999997E-2},{"$f":"-1*FV(H12,G12,1)","v":92.59728264708707},{"$f":"(('Metering costs'!$B$9/'Metering costs'!$E$28)*F12)/I12","v":0.4902883459594421}]
[]
[]
[]
[null,null,null,null,"Asset Class",null,"TOTAL","Annuity"]
[null,null,null,"B","Communication pipes & stop taps",null,{"$f":"IFERROR(SUM(J20:J21),\"\")","v":""}]
[]
[null,null,null,"Yrs","Asset","£/property","Asset Life","Rate","Annuity","Final Cost"]
[null,null,null,1,"Stop Taps",{"$f":"'Water costs'!$C$61","v":{"$error":"#VALUE!"}},{"$f":"'Asset lives'!$G$10","v":15},{"$f":"$F$3","v":3.8899999999999997E-2},{"$f":"-1*FV(H20,G20,1)","v":19.860705017658123},{"$f":"(G20*F20)/I20","v":{"$error":"#VALUE!"}}]
{"$rows_left_out":27}
{"sheet":"Asset lives","index":6,"n_rows":80,"n_cols":7,"rows_kept":80,"cut":false,"hidden":true,"merged":[[0,1,1,2],[2,1,3,1],[2,2,3,2]]}
[null,"Asset Classes taken from models in UCD 21/02/2017 (PR19 Proforma)"]
[null,null,null,null,null,"Asset Categories","Asset Life (Yrs)"]
[null,"Asset Life","Years",null,1,"AMR Meters - 15 years",15]
[null,null,null,null,2,{"$f":"B34","v":"Meter Chamber - 40 Years"},{"$f":"VLOOKUP(F4,$B$5:$C$80,2,0)","v":40}]
[null,"AMR Meters - 15 years",15,null,3,"Process Plant - E&M Components - 25 Years",25]
[null,"Boreholes - 60 Years",60,null,4,{"$f":"B75","v":"Water Mains (Comm Pipes) - 70 Years"},70]
[null,"Bridges - 60 Years",60,null,5,"Water Mains (All PVC) - 70 Years",70]
[null,"Catchwaters - 100 Years",100,null,6,"Sewers (All PVC) - 40 Years",40]
[null,"CSOs - 100 Years",100,null,7,"Sewers (300 to 1000mm) - 100 Years",100]
[null,"Detention Tank - 100 Years",100,null,8,"Equip eg ICA - equip & valves - 15 Years",15]
[null,"Earthbank/Concrete Dams - 200 Years",200,null,9,"Water Mains (300 to 600mm) - 100 Years",100]
[null,"Equip eg H'ware/S'ware/S'ware Dev - 5 Years",5]
[null,"Equip eg ICA - equip & valves - 15 Years",15]
[null,"Equip eg ICA - equip only - 7 Years",7]
[null,"Equip eg Modelling & D'bases - 7 Years",7]
[null,"Equip eg Outstat's & Inst - 10 Years",10]
[null,"Equip eg Tel/Comms/Cabling/Elec - 20 Years",20]
[null,"Equip eg Telemetry at one Site - 15 Years",15]
[null,"Equipment / Computers - 3 Years",3]
[null,"Equipment eg Water Meters - 12 years",12]
{"$rows_left_out":61}
{"sheet":"York tariffs","index":7,"n_rows":0,"n_cols":0,"rows_kept":0,"cut":false,"hidden":false,"merged":[]}

{"sheet":"Bidding Costs","index":8,"n_rows":21,"n_cols":28,"rows_kept":21,"cut":false,"hidden":true,"merged":[]}
["Date:",null,"2020-03-26"]
["Name:",null,"Dimitra K"]
[]
["Annuities represent a loan or investment which offer monthly fixed payments until the account is deplted or paid off."]
[null,"2017/18",null,"2019/20"]
["Interest Rate",4.7699999999999999E-2,null,3.8899999999999997E-2]
["Payment Periods",25,null,25,"years"]
["Bidding Cost",-15000,null,{"$f":"B8*0.176+B8","v":-17640},"£"]
["Nr of properties",null,null,{"$f":"'Wholesale Tariff'!$D$33","v":0}]
[]
[null,null,"Years",1,2,3,4,5,6,7,8,9,10,11,12,13,14,15,16,17,18,19,20,21,22,23,24,25]
[null,null,"Initial Payment",{"$f":"D8","v":-17640}]
[null,null,"Payments",{"$f":"PMT($D$6,$D$7,$D$8)","v":1116.0806242065387},{"$f":"PMT($D$6,$D$7,$D$8)","v":1116.0806242065387},1116.0806242065387,1116.0806242065387,1116.0806242065387,1116.0806242065387,1116.0806242065387,1116.0806242065387,1116.0806242065387,1116.0806242065387,1116.0806242065387,1116.0806242065387,1116.0806242065387,1116.0806242065387,1116.0806242065387,1116.0806242065387,1116.0806242065387,1116.0806242065387,1116.0806242065387,1116.0806242065387,1116.0806242065387,1116.0806242065387,1116.0806242065387,1116.0806242065387,1116.0806242065387]
[]
[null,null,"Final payment",{"$f":"SUM(D12:D13)","v":-16523.919375793463},{"$f":"SUM(E12:E13)","v":1116.0806242065387},1116.0806242065387,1116.0806242065387,1116.0806242065387,1116.0806242065387,1116.0806242065387,1116.0806242065387,1116.0806242065387,1116.0806242065387,1116.0806242065387,1116.0806242065387,1116.0806242065387,1116.0806242065387,1116.0806242065387,1116.0806242065387,1116.0806242065387,1116.0806242065387,1116.0806242065387,1116.0806242065387,1116.0806242065387,1116.0806242065387,1116.0806242065387,1116.0806242065387,1116.0806242065387]
[null,null,null,{"$f":"PV(D6,D7,D13:AB13)","v":-17639.999999999971},"<<calculate original investment amount"]
[]
[]
["NPV",null,{"$f":"NPV(D6,D15:AB15)","v":660.50245451921808}]
[]
{"$rows_left_out":2}
{"sheet":"Wholesale charges","index":9,"n_rows":37,"n_cols":6,"rows_kept":37,"cut":false,"hidden":true,"merged":[]}
[1,"Yorkshire Water Measured NH Water and Wastewater Charges (excl. York Waterworks)"]
[null,"Description","Units","2020/21 Wholesale water NH charges","2020/21 Wholesale wastewater NH charges","Tariff Report Name"]
[null,"Standard Tariff 0-20","p/m3",136.21,171.61,"Metered Volumetric Charges"]
[null,"Standard Tariff 20-50","p/m3",136.21,171.61,"Metered Volumetric Charges"]
[null,"Banded Tariff 50-100","p/m3",86.98,171.61,"Metered Volumetric Charges"]
[null,"Banded Tariff  100-250","p/m3",86.98,138.71,"Metered Volumetric Charges"]
[null,"Banded Tariff >250 Mla","p/m3",73.41,126.61,"Metered Volumetric Charges"]
[]
[]
[]
[2,"Yorkshire Water Measured HH Water and Wastewater Charges (excl. York Waterworks)"]
[null,"Description","Units","2020/21 Wholesale water HH charges","2020/21 Wholesale wastewater HH charges"]
[null,"Fixed Charge","£",9.89,0]
[null,"Volumetric Charge","p/m3",138.85,179.32]
[]
[]
[null,"*If a NAV applies for a site within the defined geographical area of York Waterworks, then the relevant water tariff should be applied. Wastewater tariffs are the same in both cases."]
[3,"York Waterworks Measured NH Water and Wastewater Charges "]
[null,"Description","Units","2020/21 Wholesale water NH charges","Tariff Report Name"]
[null,"Standard Tariff 0-5","p/m3",75.47,"Metered Volumetric Charges"]
{"$rows_left_out":18}
{"sheet":"Scientific services","index":10,"n_rows":88,"n_cols":7,"rows_kept":88,"cut":false,"hidden":true,"merged":[[14,0,14,9],[76,0,87,0],[16,0,27,0],[28,0,39,0],[40,0,51,0],[52,0,63,0],[64,0,75,0]]}
["YW Source:","Sampling and Analysis Manager, Clare Beasant, August 2018, 'WSZ Sample Costs 2015'"]
["YW Definition:","‘Any costs YW takes over for the collection and analysis of samples for scientific purposes per year per property’"]
["DWI guidance:","DWI - Guidance on the Regulatory Responsibilities of NAVs in relation to Public Water Supplies"]
[]
["Source data: ","For the estimation of the sampling cost we use the financial year 2017/18 and the nr of properties from APR 2017/18"]
["Properties 2018/19",2299162]
[]
[null,"Year","Annual Total Cost","Aveg Cost per year","£ / property / year","3yr average"]
[null,"2015/16",{"$f":"SUM(D20:D31)","v":1021269.9700000059},{"$f":"C9/12","v":85105.830833333821},{"$f":"C9/$B$6","v":0.44419226222423908}]
[null,"2016/17",{"$f":"SUM(D32:D43)","v":1068594.1099999831},{"$f":"C10/12","v":89049.509166665259},{"$f":"C10/$B$6","v":0.46477547471643282}]
[null,"2017/18",{"$f":"SUM(D44:D55)","v":957061.99000000185},79755.165833333493,{"$f":"C11/$B$6","v":0.41626557415267035}]
[null,"2018/19",{"$f":"SUM(D56:D67)","v":952558.28999999387},79379.857499999489,{"$f":"C12/$B$6","v":0.41430673001728191},{"$f":"AVERAGE(E12)","v":0.41430673001728191},"<< Average sampling cost for 3 years"]
[null,"2019/20",{"$f":"SUM(D68:D79)","v":798001.35999999079},{"$f":"C13/12","v":66500.113333332571},{"$f":"C13/$B$6","v":0.34708357218847163}]
[]
["Sampling Costs 2015 - 2018"]
["YEAR","Month","Regulatory Cost","Total Cost"]
[{"$f":"YEAR(B17)","v":2015},"2015-01-01"]
[null,"2015-02-01"]
[null,"2015-03-01"]
[null,"2015-04-01",39299.339999999997,75701.659999999989]
{"$rows_left_out":69}
{"sheet":"Metering costs","index":11,"n_rows":38,"n_cols":10,"rows_kept":38,"cut":false,"hidden":true,"merged":[[7,1,7,9]]}
["Source:","Billing solutions Team Leader, Kelly Lloyd, August 2018 'MEX data 13.08.2018' &"]
[null,"Capital Scheme Project Manager, Chris Daw, October 2018"]
["Definition:","Meter and Chamber replacement/renewal include costs for asset material, fuel, team plant, support plant,"]
[null,"consumable materials, management fee, non asset materials, non productive labour, productive labour, site overhead, sub contract invoice"]
["Important comment: When the NAV application is fo WATER ONLY then the meter cost is 100% water avoidable cost, when the application is for water and wastewater is 50/50 between water and wastewater,"]
[null,null,"when is for wastewater only the meter costs are 0"]
[]
[null,"Meter and meter chamber Renewal/Replacement Costs"]
["Metered Properties 2018/19",{"$f":"1145.569*1000","v":1145569},"<< APR Datashare 2018 -Table 4Q"]
["Properties 2018/19",{"$f":"2319.165*1000","v":2319165},"<< APR Datashare 2018 -Table 4Q"]
[]
[]
[null,"Years","Nr of HH meters renewed","Nr of NHH meters renewed","Total nr of meters renewed"]
[1,"2010-11",76920,9377,{"$f":"SUM(C14:D14)","v":86297}]
[2,"2011-12",46467,10964,{"$f":"SUM(C15:D15)","v":57431}]
[3,"2012-13",134405,20854,155259]
[4,"2013-14",48378,12982,61360]
[5,"2014-15",4107,1650,5757]
[6,"2015-16",27453,5347,32800]
[7,"2016-17",33359,4264,37623]
{"$rows_left_out":19}
{"sheet":"Water costs","index":12,"n_rows":67,"n_cols":14,"rows_kept":67,"cut":false,"hidden":true,"merged":[[6,1,6,9],[31,1,31,9],[24,1,25,1],[24,3,25,3],[24,4,25,4],[23,5,23,6],[24,5,25,6],[34,4,34,5],[35,4,35,5],[44,1,45,1],[44,2,45,2],[63,1,63,9],[58,1,59,1],[58,2,59,2],[60,1,61,1],[60,2,61,2]]}
[0,"Liam Saddler, Strategic Asset Manager - Clean Water Networks, October 2018"]
["1. definition:","The costs cover Flushing and Linning (current cleaning methods). Both cleaning techniques are predominantly done  on YW's distribution network rather than trunk main network."]
[]
["2,3 source:","Martin Hopkins, Finance Business Partner, October 2018"]
["2,3 definition:","R&M expenditure on street furniture renewal, Communication pipes (flow/pressure), stop tap installations/renewals, CS&N stop tap adaptors"]
[]
["1.","Water Operational Costs"]
["Properties 2018/19",{"$f":"2319.165*1000","v":2319165},"<< APR Datashare 2018 -Table 4Q"]
["Nr of DMA:",2500,"<< Provided by Katy Walker"]
[]
[null,"CCC Table 11 - Water services",null,null,null,null,null,null,null,null,"APR Datashare 2018/19"]
[null,null,"2011/12","2012/13","2013/14","2014/15","2015/16","2016/17","2017/18",null,"Parameter","km","meters","meters/property"]
[null,"Total length of potable mains as at 31 March (km)",31270.3,31274.080000000002,31363.38,31404.9,31531.96,31604.71,31693.4,null,"Total Length of Mains 2018/19",31790.1,{"$f":"L13*1000","v":31790100},{"$f":"M13/B8","v":13.707562851284838}]
[null,"Total length of mains relined",19.05,6.61,13,0.2,7,3.0139999999999998,15.41]
[null,"Total length of mains renewed (km)",125.19,112.87,75.3,6.27,29.2,43.64,25.78]
[null,"Mains cleaned (km)",241.29,147.33000000000001,22.6,13.54,20.54,26.34]
[]
[null,"Rate mains cleaned",{"$f":"C16/$C$13","v":7.7162675126237999E-3},{"$f":"D16/$D$13","v":4.7109299458209485E-3},{"$f":"E16/$E$13","v":7.2058560014896355E-4},{"$f":"F16/$F$13","v":4.3114291081964911E-4},{"$f":"G16/$G$13","v":6.5140257694098309E-4},{"$f":"H16/H13","v":8.334200820067642E-4}]
[null,"Rate of relining",{"$f":"C14/C13","v":6.0920426091211149E-4},2.11357136644787E-4,4.1449614167860731E-4,6.3684329515457777E-6,2.2199698337813445E-4,9.5365532542459653E-5,4.8622110597159029E-4]
[null,"Rate renewed",{"$f":"C15/C13","v":4.0034793398208528E-3},{"$f":"D15/D13","v":3.6090590034942673E-3},2.4008891898768562E-3,1.9965037303096013E-4,9.2604455923450365E-4,1.3808068480932114E-3,8.1341856664163519E-4]
{"$rows_left_out":48}
{"sheet":"Leakage costs","index":13,"n_rows":30,"n_cols":9,"rows_kept":30,"cut":false,"hidden":true,"merged":[[4,1,4,8]]}
["Source:","Martin Hopkins, Finance Business Partner, April 2019"]
["Definition:","Annual leakage Find & Fix costs - Reactive R&M and Proactive leakage"]
[null," "]
[]
[null,"Leakage Management Costs & Leakage Allowance"]
["Properties 2018/19",{"$f":"2319.165*1000","v":2319165},"<< APR Datashare 2018 -Table 4Q"]
["Total length of mains (km)",31790.1]
[]
[null,"1. Leakage Management Cost"]
[]
[null,null," 2015/16 "," 2016/17 "," 2017/18 "," 2018/19"]
[null," Reactive R&M ",8921428,11940917,14224491,18824339]
[null," Proactive Leakage ",10451975,9552427,16342953,33208227,null,"4yrs average"]
[null,"Total",{"$f":"SUM(C12:C13)","v":19373403},{"$f":"SUM(D12:D13)","v":21493344},{"$f":"SUM(E12:E13)","v":30567444},{"$f":"SUM(F12:F13)","v":52032566},null,{"$f":"AVERAGE(C16:F16)","v":{"$error":"#VALUE!"}},"<< leakage management cost for YW"]
[null,"£/meter for YW",{"$f":"C14/($B$7*10^3)","v":0.6094162333556673},{"$f":"D14/($B$7*10^3)","v":0.67610180527900199},0.96153972463125315,{"$f":"F14/($B$7*10^3)","v":1.6367537692552083}]
[null,"£/prop NAV",{"$f":"C15*'Wholesale Tariff'!$D$63","v":{"$error":"#VALUE!"}},{"$f":"D15*'Wholesale Tariff'!$D$63","v":{"$error":"#VALUE!"}},{"$f":"E15*'Wholesale Tariff'!$D$63","v":{"$error":"#VALUE!"}},{"$f":"F15*'Wholesale Tariff'!$D$63","v":{"$error":"#VALUE!"}}]
[]
[]
[null,"2. Leakage Allowance"]
[null,"Method 1 - APR Datashare 2018 - Table 4P (line 74)"]
{"$rows_left_out":11}
{"sheet":"Wastewater costs","index":14,"n_rows":46,"n_cols":16,"rows_kept":46,"cut":false,"hidden":true,"merged":[[29,1,29,19],[4,1,4,19],[7,2,7,3],[7,4,7,5],[7,6,7,7],[7,8,7,9],[7,10,7,11],[20,12,20,13],[20,14,20,15]]}
["Source:","Peter Bennett, Finance Business Partner (Waste Water), October 2018"]
[null,"Mark Thompson, Capital Process Manager, December 2018"]
["Definition:","Total expenditure for Jetting, Vactor, CCTV and Densilts"]
[]
["1.","Sewerage Operational Costs"]
["Properties 2018/19",{"$f":"2299.162*1000","v":2299162}]
[null,null,"Provided by Peter Bennett"]
[null,null,"2014-15",null,"2015-16",null,"2016-17",null,"2017-18",null,"2018-19"]
[null,"Activities (£m)","OPEX","CAPEX","OPEX","CAPEX","OPEX","CAPEX","OPEX","CAPEX","OPEX","CAPEX"]
[1,"Jetting",4827550.17,1469977.83,4555664.17,1101725.6000000001,4348373,983054,4728000,1286000,7017104,647759]
[2,"Vactor",2219526.46,88830.54,2388440.87,87390.59,3852008.83,29410,3673000,87000,3265399,129429]
[3,"CCTV",1006218.06,163509.12,744499.96,120050.9,1371729,118278.17,746000,85000,657350,22762]
[4,"Desilts",1271632.4300000002,17679.57,1124842.25,40357.01,959572,29410,712000,6000,612337,3037]
[null,"TOTAL",{"$f":"SUM(C10:C13)","v":9324927.1199999992},{"$f":"SUM(D10:D13)","v":1739997.0600000003},8813447.25,1349524.1,10531682.83,1160152.17,9859000,1464000,{"$f":"SUM(K10:K13)","v":11552190},802987]
[]
[null,"APR Datashare 2018/19","Length (km)","Length (meter)"]
[null,"Total length of combined public sewers 2017/18",16265.903433973994,{"$f":"C17*1000","v":16265903.433973994}]
[]
[]
[]
{"$rows_left_out":27}
{"sheet":"Business overhead","index":15,"n_rows":17,"n_cols":4,"rows_kept":17,"cut":false,"hidden":true,"merged":[[0,1,0,6]]}
[null,"Business Overhead"]
[]
[null,null,"£m"]
[1,"HH Retail Opex",60.991,"<<APR datashare Table 2C 2018/19"]
[2,"Loop Recharge",{"$f":"4.765693+4.765693*0.176","v":5.6044549679999998},"<<Provided by Naomi Scholey"]
[3,"YKS Charge",{"$f":"0.956819+0.956819*0.176","v":1.1252191439999999}]
[]
[null,"TOTAL",{"$f":"SUM(C5:C6)","v":6.7296741119999997}]
[null,"% Overhead",{"$f":"C8/C4","v":0.11033880592218523}]
[]
[]
["Source: ''Section 3 Wholesale Minus\", David Musco"]
["Business overhead calculation is based on the idea"]
["that the incumbnent's HH retail arm will notionally"]
["extend its business activities to embrace the local"]
["network management/operation on these same"]
["new developments."]