{"text_format":"1","workbook":"xlsx","n_sheets":2,"sheets":["Scour Tests","Scour Tests (2)"],"not_rendered":{"charts":0,"images":0,"macros":1,"external_links":0,"defined_names":2,"comments":0,"pivot_tables":0},"unopened":[],"bounds":{"document_bytes":16777216,"sheet_cells":100000,"rows_first":2000,"rows_last":500,"rows_between":2000,"halvings":0,"cell_chars":16384,"cell_head_chars":4096},"cells_cut":0,"cells_raw":0,"read":"whole","date_system":"1900"}

{"sheet":"Scour Tests","index":0,"n_rows":234,"n_cols":7,"rows_kept":234,"cut":false,"hidden":false,"merged":[]}
["RESERVOIR","DATE","NGR OF DISCHARGE POINT","NAME OF WATERCOURSE AFFECTED","MAX OUTFLOW RATE (Ml/d)","OPERATIONAL CATCHMENT","WB-ID"]
["AGDEN/IRE","2025-03-05","SK 261 923","Agden Beck",170,"Upper Don","GB104027057390"]
["AGDEN/IRE","2025-11-06","SK 261 923","Agden Beck",170,"Upper Don","GB104027057390"]
["ALBERT/ESR","2025-04-22","SE 073 257","To Sewer",31,"Middle Calder","GB104027062780"]
["ALBERT/ESR","2025-10-16","SE 073 257","To Sewer",31,"Middle Calder","GB104027062780"]
["ANGRAM/IRE","2025-02-06","SE 044 764","Scar House IRE",186,"Upper Nidd","GB104027064120"]
["ANGRAM/IRE","2025-09-16","SE 044 764","Scar House IRE",186,"Upper Nidd","GB104027064120"]
["ARDSLEY/ESR","2025-04-29","SE 290 246","Haigh Moor Beck",86,"Lower Calder","GB104027062620"]
["ARDSLEY/ESR","2025-09-30","SE 290 246","Haigh Moor Beck",86,"Lower Calder","GB104027062620"]
["BAITINGS/IRE","2025-04-08","SE 011 188","River Ryburn",347,"Middle Calder","GB104027062540"]
["BAITINGS/IRE","2025-09-11","SE 011 188","River Ryburn",347,"Middle Calder","GB104027062540"]
["BARDEN LOWER/IRE","2025-02-04","SE 040 565","Barden Beck",60,"Middle Wharfe and Washburn","GB104027064060"]
["BARDEN LOWER/IRE","2025-08-19","SE 040 565","Barden Beck",60,"Middle Wharfe and Washburn","GB104027064060"]
["BARDEN UPPER/IRE","2025-06-24","SE 017 576","Barden Beck",99,"Middle Wharfe and Washburn","GB104027064060"]
["BARDEN UPPER/IRE","2025-12-11","SE 017 576","Barden Beck",99,"Middle Wharfe and Washburn","GB104027064060"]
["BILBERRY/IRE","2025-02-04","SE 103 070","Digley IRE","N/A","Colne & Holme","GB104027057600"]
["BILBERRY/IRE","2025-09-18","SE 103 070","Digley IRE","N/A","Colne & Holme","GB104027057600"]
["BLACKMOORFOOT/IRE","2025-03-20","SE 001 545","Embsay Beck",156,"Upper Aire",{"$error":"#REF!"}]
["BLACKMOORFOOT/IRE","2025-11-04",{"$error":"#N/A"},{"$error":"#N/A"},{"$error":"#N/A"},{"$error":"#N/A"},{"$error":"#N/A"}]
["BLAKELEY/IRE","2025-03-27","SE 053 097","Butterley IRE",1170,"Colne & Holme","GB104027063190"]
["BLAKELEY/IRE","2025-06-17","SE 053 097","Butterley IRE",1170,"Colne & Holme","GB104027063190"]
["BOOTH WOOD/IRE","2025-04-24","SE 032 165","Booth Dean Clough",55,"Middle Calder","GB104027062520"]
["BOOTH WOOD/IRE","2025-09-11","SE 032 165","Booth Dean Clough",55,"Middle Calder","GB104027062520"]
["BOSHAW WHAMS/IRE","2025-01-30","SE 151 058","Upper House Dyke",80,"Colne & Holme","GB104027057610"]
["BOSHAW WHAMS/IRE","2025-08-19","SE 151 058","Upper House Dyke",80,"Colne & Holme","GB104027057610"]
["BRANSHOLME/SLK","2025-01-21","TA 086 339","River Hull",50,"Hull Lower","GB104026067212"]
["BRANSHOLME/SLK","2025-07-26","TA 086 339","River Hull",50,"Hull Lower","GB104026067212"]
["BROADSTONES/ESR","2025-01-07","SE 196 065","Broadstones Dike",37,"Upper Don","GB104027057530"]
["BROADSTONES/ESR","2025-06-17","SE 196 065","Broadstones Dike",37,"Upper Don","GB104027057530"]
["BROOMHEAD/IRE","2025-06-26","SK 269 960","Morehall IRE",483,"Upper Don","GB104027057400"]
["BROOMHEAD/IRE","2025-12-04","SK 269 960","Morehall IRE",483,"Upper Don","GB104027057400"]
["BROWNHILL/IRE","2025-03-18","SE 117 064","River Holme",158,"Colne & Holme","GB104027057600"]
["BROWNHILL/IRE","2025-11-13","SE 117 064","River Holme",158,"Colne & Holme","GB104027057600"]
["BUTTERLEY/IRE","2025-01-09","SE 047 108","Wessenden Brook",1304,"Colne & Holme","GB104027063190"]
["BUTTERLEY/IRE","2025-06-17","SE 047 108","Wessenden Brook",1304,"Colne & Holme","GB104027063190"]
["CARR BOTTOM/IRE","2025-03-11","SE 147 445","Carr Beck",41,"Middle Wharfe and Washburn","GB104027064258"]
["CARR BOTTOM/IRE","2025-09-18","SE 147 445","Carr Beck",41,"Middle Wharfe and Washburn","GB104027064258"]
["CHELKER/IRE","2025-01-07","SE 052 518","Bank Gill Beck",84,"Middle Wharfe and Washburn","GB104027064030"]
["CHELKER/IRE","2025-06-17","SE 052 518","Bank Gill Beck",84,"Middle Wharfe and Washburn","GB104027064030"]
["COD BECK/IRE","2025-05-15","SE 462 985","Cod Beck",257,"Lower Swale","GB104027069010"]
{"$rows_left_out":195}
{"sheet":"Scour Tests (2)","index":1,"n_rows":277,"n_cols":15,"rows_kept":277,"cut":false,"hidden":true,"merged":[]}
[null,null,null,null,null,null,null,null,null,null,"Please copy formula down in the grey columns, they are linked to Lookup (Lup) sheet"]
[]
["RESERVOIR","TEST TYPE","DATE","DAY","NOTIFICATION DATE","AREA EXPERT","No OF PEOPLE REQUIRED","AREA","SAME DAY AS","COMMENTS","NGR OF DISCHARGE POINT","NAME OF WATERCOURSE AFFECTED","MAX OUTFLOW RATE (Ml/d)","OPERATIONAL CATCHMENT","WB-ID"]
["ELVINGTON/NO 1 ESR","Scour Test","2020-12-22","Tuesday","2020-11-30","Sean Wright",3,"East",null,null,{"$f":"VLOOKUP(A4,#REF!,2,FALSE)","v":{"$error":"#REF!"}},{"$f":"VLOOKUP(A4,#REF!,3,FALSE)","v":{"$error":"#REF!"}},{"$f":"VLOOKUP(A4,#REF!,4,FALSE)","v":{"$error":"#REF!"}},{"$f":"VLOOKUP(A4,#REF!,7,FALSE)","v":{"$error":"#REF!"}},{"$f":"VLOOKUP(A4,#REF!,5,FALSE)","v":{"$error":"#REF!"}}]
["ELVINGTON/NO 2 ESR","Scour Test","2020-12-22","Tuesday","2020-11-30","Sean Wright",3,"East",null,null,{"$f":"VLOOKUP(A5,#REF!,2,FALSE)","v":{"$error":"#REF!"}},{"$f":"VLOOKUP(A5,#REF!,3,FALSE)","v":{"$error":"#REF!"}},{"$f":"VLOOKUP(A5,#REF!,4,FALSE)","v":{"$error":"#REF!"}},{"$f":"VLOOKUP(A5,#REF!,7,FALSE)","v":{"$error":"#REF!"}},{"$f":"VLOOKUP(A5,#REF!,5,FALSE)","v":{"$error":"#REF!"}}]
["ELVINGTON/NO 3 ESR","Scour Test","2020-12-22","Tuesday","2020-11-30","Sean Wright",3,"East",null,null,{"$f":"VLOOKUP(A6,#REF!,2,FALSE)","v":{"$error":"#REF!"}},{"$f":"VLOOKUP(A6,#REF!,3,FALSE)","v":{"$error":"#REF!"}},{"$f":"VLOOKUP(A6,#REF!,4,FALSE)","v":{"$error":"#REF!"}},{"$f":"VLOOKUP(A6,#REF!,7,FALSE)","v":{"$error":"#REF!"}},{"$f":"VLOOKUP(A6,#REF!,5,FALSE)","v":{"$error":"#REF!"}}]
["BARDEN LOWER/IRE","Scour Test","2021-01-05","Tuesday","2020-11-30","Dave Driver",3,"North West",null,null,{"$f":"VLOOKUP(A7,#REF!,2,FALSE)","v":{"$error":"#REF!"}},{"$f":"VLOOKUP(A7,#REF!,3,FALSE)","v":{"$error":"#REF!"}},{"$f":"VLOOKUP(A7,#REF!,4,FALSE)","v":{"$error":"#REF!"}},{"$f":"VLOOKUP(A7,#REF!,7,FALSE)","v":{"$error":"#REF!"}},{"$f":"VLOOKUP(A7,#REF!,5,FALSE)","v":{"$error":"#REF!"}}]
["BLAKELEY/IRE","Scour Test","2021-01-05","Tuesday","2020-11-30","Luke Shackleton",2,"West","Wes' Old",null,{"$f":"VLOOKUP(A8,#REF!,2,FALSE)","v":{"$error":"#REF!"}},{"$f":"VLOOKUP(A8,#REF!,3,FALSE)","v":{"$error":"#REF!"}},{"$f":"VLOOKUP(A8,#REF!,4,FALSE)","v":{"$error":"#REF!"}},{"$f":"VLOOKUP(A8,#REF!,7,FALSE)","v":{"$error":"#REF!"}},{"$f":"VLOOKUP(A8,#REF!,5,FALSE)","v":{"$error":"#REF!"}}]
["WESSENDEN OLD/IRE","Scour Test","2021-01-05","Tuesday","2020-11-30","Luke Shackleton",2,"West","Blakely",null,{"$f":"VLOOKUP(A9,#REF!,2,FALSE)","v":{"$error":"#REF!"}},{"$f":"VLOOKUP(A9,#REF!,3,FALSE)","v":{"$error":"#REF!"}},{"$f":"VLOOKUP(A9,#REF!,4,FALSE)","v":{"$error":"#REF!"}},{"$f":"VLOOKUP(A9,#REF!,7,FALSE)","v":{"$error":"#REF!"}},{"$f":"VLOOKUP(A9,#REF!,5,FALSE)","v":{"$error":"#REF!"}}]
["CHELKER/IRE","Scour Test","2021-01-07","Thursday","2020-11-30","Dave Driver",2,"North West",null,null,{"$f":"VLOOKUP(A10,#REF!,2,FALSE)","v":{"$error":"#REF!"}},{"$f":"VLOOKUP(A10,#REF!,3,FALSE)","v":{"$error":"#REF!"}},{"$f":"VLOOKUP(A10,#REF!,4,FALSE)","v":{"$error":"#REF!"}},{"$f":"VLOOKUP(A10,#REF!,7,FALSE)","v":{"$error":"#REF!"}},{"$f":"VLOOKUP(A10,#REF!,5,FALSE)","v":{"$error":"#REF!"}}]
["FEWSTON/IRE","F/V Test","2021-01-07","Thursday","2020-11-30","Jim Lester",3,"North",null,null,{"$f":"VLOOKUP(A11,#REF!,2,FALSE)","v":{"$error":"#REF!"}},{"$f":"VLOOKUP(A11,#REF!,3,FALSE)","v":{"$error":"#REF!"}},{"$f":"VLOOKUP(A11,#REF!,4,FALSE)","v":{"$error":"#REF!"}},{"$f":"VLOOKUP(A11,#REF!,7,FALSE)","v":{"$error":"#REF!"}},{"$f":"VLOOKUP(A11,#REF!,5,FALSE)","v":{"$error":"#REF!"}}]
["BROADSTONES/ESR","F/V Test","2021-01-07","Thursday","2020-11-30","Dan Lucks",2,"South",null,null,{"$f":"VLOOKUP(A12,#REF!,2,FALSE)","v":{"$error":"#REF!"}},{"$f":"VLOOKUP(A12,#REF!,3,FALSE)","v":{"$error":"#REF!"}},{"$f":"VLOOKUP(A12,#REF!,4,FALSE)","v":{"$error":"#REF!"}},{"$f":"VLOOKUP(A12,#REF!,7,FALSE)","v":{"$error":"#REF!"}},{"$f":"VLOOKUP(A12,#REF!,5,FALSE)","v":{"$error":"#REF!"}}]
["BARDEN UPPER/IRE","Scour Test","2021-01-12","Tuesday","2020-11-30","Dave Driver",6,"North West",null,null,{"$f":"VLOOKUP(A13,#REF!,2,FALSE)","v":{"$error":"#REF!"}},{"$f":"VLOOKUP(A13,#REF!,3,FALSE)","v":{"$error":"#REF!"}},{"$f":"VLOOKUP(A13,#REF!,4,FALSE)","v":{"$error":"#REF!"}},{"$f":"VLOOKUP(A13,#REF!,7,FALSE)","v":{"$error":"#REF!"}},{"$f":"VLOOKUP(A13,#REF!,5,FALSE)","v":{"$error":"#REF!"}}]
["LOWER LAITHE/IRE","F/V Test","2021-01-14","Thursday","2020-11-30","Tom Young (NW)",6,"North West","Scargill",null,{"$f":"VLOOKUP(A14,#REF!,2,FALSE)","v":{"$error":"#REF!"}},{"$f":"VLOOKUP(A14,#REF!,3,FALSE)","v":{"$error":"#REF!"}},{"$f":"VLOOKUP(A14,#REF!,4,FALSE)","v":{"$error":"#REF!"}},{"$f":"VLOOKUP(A14,#REF!,7,FALSE)","v":{"$error":"#REF!"}},{"$f":"VLOOKUP(A14,#REF!,5,FALSE)","v":{"$error":"#REF!"}}]
["SCARGILL/IRE","Scour Test","2021-01-14","Thursday","2020-12-14","Alex Haggarty",3,"North","Lower Laithe",null,{"$f":"VLOOKUP(A15,#REF!,2,FALSE)","v":{"$error":"#REF!"}},{"$f":"VLOOKUP(A15,#REF!,3,FALSE)","v":{"$error":"#REF!"}},{"$f":"VLOOKUP(A15,#REF!,4,FALSE)","v":{"$error":"#REF!"}},{"$f":"VLOOKUP(A15,#REF!,7,FALSE)","v":{"$error":"#REF!"}},{"$f":"VLOOKUP(A15,#REF!,5,FALSE)","v":{"$error":"#REF!"}}]
["THORNTON MOOR/IRE","F/V Test","2021-01-19","Tuesday","2020-11-30","Phil Preston",3,"North West",null,null,{"$f":"VLOOKUP(A16,#REF!,2,FALSE)","v":{"$error":"#REF!"}},{"$f":"VLOOKUP(A16,#REF!,3,FALSE)","v":{"$error":"#REF!"}},{"$f":"VLOOKUP(A16,#REF!,4,FALSE)","v":{"$error":"#REF!"}},{"$f":"VLOOKUP(A16,#REF!,7,FALSE)","v":{"$error":"#REF!"}},{"$f":"VLOOKUP(A16,#REF!,5,FALSE)","v":{"$error":"#REF!"}}]
["BRANSHOLME/SLK","F/V Test","2021-01-19","Tuesday","2020-11-30","Roger Blount",3,"Waste",null,null,{"$f":"VLOOKUP(A17,#REF!,2,FALSE)","v":{"$error":"#REF!"}},{"$f":"VLOOKUP(A17,#REF!,3,FALSE)","v":{"$error":"#REF!"}},{"$f":"VLOOKUP(A17,#REF!,4,FALSE)","v":{"$error":"#REF!"}},{"$f":"VLOOKUP(A17,#REF!,7,FALSE)","v":{"$error":"#REF!"}},{"$f":"VLOOKUP(A17,#REF!,5,FALSE)","v":{"$error":"#REF!"}}]
["AGDEN/IRE","Scour Test","2021-01-21","Thursday","2020-11-30","Elliot Beever",2,"South",null,null,{"$f":"VLOOKUP(A18,#REF!,2,FALSE)","v":{"$error":"#REF!"}},{"$f":"VLOOKUP(A18,#REF!,3,FALSE)","v":{"$error":"#REF!"}},{"$f":"VLOOKUP(A18,#REF!,4,FALSE)","v":{"$error":"#REF!"}},{"$f":"VLOOKUP(A18,#REF!,7,FALSE)","v":{"$error":"#REF!"}},{"$f":"VLOOKUP(A18,#REF!,5,FALSE)","v":{"$error":"#REF!"}}]
["MARCH GHYLL/IRE","F/V Test","2021-01-21","Thursday","2020-11-30","Ben Wilson",3,"North West",null,null,{"$f":"VLOOKUP(A19,#REF!,2,FALSE)","v":{"$error":"#REF!"}},{"$f":"VLOOKUP(A19,#REF!,3,FALSE)","v":{"$error":"#REF!"}},{"$f":"VLOOKUP(A19,#REF!,4,FALSE)","v":{"$error":"#REF!"}},{"$f":"VLOOKUP(A19,#REF!,7,FALSE)","v":{"$error":"#REF!"}},{"$f":"VLOOKUP(A19,#REF!,5,FALSE)","v":{"$error":"#REF!"}}]
["STUBDEN/IRE","F/V Test","2021-01-21","Thursday","2020-11-30","Phil Preston",3,"North West",null,null,{"$f":"VLOOKUP(A20,#REF!,2,FALSE)","v":{"$error":"#REF!"}},{"$f":"VLOOKUP(A20,#REF!,3,FALSE)","v":{"$error":"#REF!"}},{"$f":"VLOOKUP(A20,#REF!,4,FALSE)","v":{"$error":"#REF!"}},{"$f":"VLOOKUP(A20,#REF!,7,FALSE)","v":{"$error":"#REF!"}},{"$f":"VLOOKUP(A20,#REF!,5,FALSE)","v":{"$error":"#REF!"}}]
["HOLMESTYES/IRE","S10 F/V Test","2021-01-21","Thursday","2020-11-30","Peter H Jackson",3,"South","Boshaw Whams",null,{"$f":"VLOOKUP(A21,#REF!,2,FALSE)","v":{"$error":"#REF!"}},{"$f":"VLOOKUP(A21,#REF!,3,FALSE)","v":{"$error":"#REF!"}},{"$f":"VLOOKUP(A21,#REF!,4,FALSE)","v":{"$error":"#REF!"}},{"$f":"VLOOKUP(A21,#REF!,7,FALSE)","v":{"$error":"#REF!"}},{"$f":"VLOOKUP(A21,#REF!,5,FALSE)","v":{"$error":"#REF!"}}]
["BOSHAW WHAMS/IRE","F/V Test","2021-01-21","Thursday","2020-11-30","Peter H Jackson",3,"South","Holmestyes",null,{"$f":"VLOOKUP(A22,#REF!,2,FALSE)","v":{"$error":"#REF!"}},{"$f":"VLOOKUP(A22,#REF!,3,FALSE)","v":{"$error":"#REF!"}},{"$f":"VLOOKUP(A22,#REF!,4,FALSE)","v":{"$error":"#REF!"}},{"$f":"VLOOKUP(A22,#REF!,7,FALSE)","v":{"$error":"#REF!"}},{"$f":"VLOOKUP(A22,#REF!,5,FALSE)","v":{"$error":"#REF!"}}]
["LEEMING/IRE","F/V Test","2021-01-26","Tuesday","2020-11-30","Tom Young (NW)",3,"North West","Leeshaw",null,{"$f":"VLOOKUP(A23,#REF!,2,FALSE)","v":{"$error":"#REF!"}},{"$f":"VLOOKUP(A23,#REF!,3,FALSE)","v":{"$error":"#REF!"}},{"$f":"VLOOKUP(A23,#REF!,4,FALSE)","v":{"$error":"#REF!"}},{"$f":"VLOOKUP(A23,#REF!,7,FALSE)","v":{"$error":"#REF!"}},{"$f":"VLOOKUP(A23,#REF!,5,FALSE)","v":{"$error":"#REF!"}}]
["DALE DIKE/IRE","Scour Test","2021-01-26","Tuesday","2020-11-30","Elliot Beever",3,"South",null,null,{"$f":"VLOOKUP(A24,#REF!,2,FALSE)","v":{"$error":"#REF!"}},{"$f":"VLOOKUP(A24,#REF!,3,FALSE)","v":{"$error":"#REF!"}},{"$f":"VLOOKUP(A24,#REF!,4,FALSE)","v":{"$error":"#REF!"}},{"$f":"VLOOKUP(A24,#REF!,7,FALSE)","v":{"$error":"#REF!"}},{"$f":"VLOOKUP(A24,#REF!,5,FALSE)","v":{"$error":"#REF!"}}]
["LEESHAW/IRE","S10 F/V Test","2021-01-28","Thursday","2020-11-30","Tom Young (NW)",3,"North West","Leeming",null,{"$f":"VLOOKUP(A25,#REF!,2,FALSE)","v":{"$error":"#REF!"}},{"$f":"VLOOKUP(A25,#REF!,3,FALSE)","v":{"$error":"#REF!"}},{"$f":"VLOOKUP(A25,#REF!,4,FALSE)","v":{"$error":"#REF!"}},{"$f":"VLOOKUP(A25,#REF!,7,FALSE)","v":{"$error":"#REF!"}},{"$f":"VLOOKUP(A25,#REF!,5,FALSE)","v":{"$error":"#REF!"}}]
["MIXENDEN/IRE","F/V Test","2021-01-28","Thursday","2020-11-30","Oliver Oates",3,"West","Ogden",null,{"$f":"VLOOKUP(A26,#REF!,2,FALSE)","v":{"$error":"#REF!"}},{"$f":"VLOOKUP(A26,#REF!,3,FALSE)","v":{"$error":"#REF!"}},{"$f":"VLOOKUP(A26,#REF!,4,FALSE)","v":{"$error":"#REF!"}},{"$f":"VLOOKUP(A26,#REF!,7,FALSE)","v":{"$error":"#REF!"}},{"$f":"VLOOKUP(A26,#REF!,5,FALSE)","v":{"$error":"#REF!"}}]
["OGDEN/IRE","F/V Test","2021-01-28","Thursday","2020-11-30","Oliver Oates",3,"West","Mixenden",null,{"$f":"VLOOKUP(A27,#REF!,2,FALSE)","v":{"$error":"#REF!"}},{"$f":"VLOOKUP(A27,#REF!,3,FALSE)","v":{"$error":"#REF!"}},{"$f":"VLOOKUP(A27,#REF!,4,FALSE)","v":{"$error":"#REF!"}},{"$f":"VLOOKUP(A27,#REF!,7,FALSE)","v":{"$error":"#REF!"}},{"$f":"VLOOKUP(A27,#REF!,5,FALSE)","v":{"$error":"#REF!"}}]
["RIVELIN LOWER/IRE","F/V Test","2021-01-28","Thursday","2020-11-30","Tony Hartley",2,"South",null,null,{"$f":"VLOOKUP(A28,#REF!,2,FALSE)","v":{"$error":"#REF!"}},{"$f":"VLOOKUP(A28,#REF!,3,FALSE)","v":{"$error":"#REF!"}},{"$f":"VLOOKUP(A28,#REF!,4,FALSE)","v":{"$error":"#REF!"}},{"$f":"VLOOKUP(A28,#REF!,7,FALSE)","v":{"$error":"#REF!"}},{"$f":"VLOOKUP(A28,#REF!,5,FALSE)","v":{"$error":"#REF!"}}]
["WALSHAW DEAN LOWER/IRE","S10 Scour Test","2021-02-02","Tuesday","2021-01-04","Simon Firth",3,"West","All Wal Deans",null,{"$f":"VLOOKUP(A29,#REF!,2,FALSE)","v":{"$error":"#REF!"}},{"$f":"VLOOKUP(A29,#REF!,3,FALSE)","v":{"$error":"#REF!"}},{"$f":"VLOOKUP(A29,#REF!,4,FALSE)","v":{"$error":"#REF!"}},{"$f":"VLOOKUP(A29,#REF!,7,FALSE)","v":{"$error":"#REF!"}},{"$f":"VLOOKUP(A29,#REF!,5,FALSE)","v":{"$error":"#REF!"}}]
["WALSHAW DEAN MIDDLE/IRE","S10 Scour Test","2021-02-02","Tuesday","2021-01-04","Simon Firth",3,"West","All Wal Deans",null,{"$f":"VLOOKUP(A30,#REF!,2,FALSE)","v":{"$error":"#REF!"}},{"$f":"VLOOKUP(A30,#REF!,3,FALSE)","v":{"$error":"#REF!"}},{"$f":"VLOOKUP(A30,#REF!,4,FALSE)","v":{"$error":"#REF!"}},{"$f":"VLOOKUP(A30,#REF!,7,FALSE)","v":{"$error":"#REF!"}},{"$f":"VLOOKUP(A30,#REF!,5,FALSE)","v":{"$error":"#REF!"}}]
["WALSHAW DEAN UPPER/IRE","S10 Scour Test","2021-02-03","Wednesday","2021-01-04","Simon Firth",3,"West","All Wal Deans",null,{"$f":"VLOOKUP(A31,#REF!,2,FALSE)","v":{"$error":"#REF!"}},{"$f":"VLOOKUP(A31,#REF!,3,FALSE)","v":{"$error":"#REF!"}},{"$f":"VLOOKUP(A31,#REF!,4,FALSE)","v":{"$error":"#REF!"}},{"$f":"VLOOKUP(A31,#REF!,7,FALSE)","v":{"$error":"#REF!"}},{"$f":"VLOOKUP(A31,#REF!,5,FALSE)","v":{"$error":"#REF!"}}]
["KEIGHLEY MOOR/IRE","F/V Test","2021-02-04","Thursday","2021-01-04","Tom Young (NW)",2,"North West",null,null,{"$f":"VLOOKUP(A32,#REF!,2,FALSE)","v":{"$error":"#REF!"}},{"$f":"VLOOKUP(A32,#REF!,3,FALSE)","v":{"$error":"#REF!"}},{"$f":"VLOOKUP(A32,#REF!,4,FALSE)","v":{"$error":"#REF!"}},{"$f":"VLOOKUP(A32,#REF!,7,FALSE)","v":{"$error":"#REF!"}},{"$f":"VLOOKUP(A32,#REF!,5,FALSE)","v":{"$error":"#REF!"}}]
["DAMFLASK/IRE","F/V Test","2021-02-04","Thursday","2021-01-04","Elliot Beever",2,"South",null,null,{"$f":"VLOOKUP(A33,#REF!,2,FALSE)","v":{"$error":"#REF!"}},{"$f":"VLOOKUP(A33,#REF!,3,FALSE)","v":{"$error":"#REF!"}},{"$f":"VLOOKUP(A33,#REF!,4,FALSE)","v":{"$error":"#REF!"}},{"$f":"VLOOKUP(A33,#REF!,7,FALSE)","v":{"$error":"#REF!"}},{"$f":"VLOOKUP(A33,#REF!,5,FALSE)","v":{"$error":"#REF!"}}]
["THRUSCROSS/IRE","F/V Test","2021-02-04","Thursday","2021-01-04","Chris Spencer",5,"North",null,null,{"$f":"VLOOKUP(A34,#REF!,2,FALSE)","v":{"$error":"#REF!"}},{"$f":"VLOOKUP(A34,#REF!,3,FALSE)","v":{"$error":"#REF!"}},{"$f":"VLOOKUP(A34,#REF!,4,FALSE)","v":{"$error":"#REF!"}},{"$f":"VLOOKUP(A34,#REF!,7,FALSE)","v":{"$error":"#REF!"}},{"$f":"VLOOKUP(A34,#REF!,5,FALSE)","v":{"$error":"#REF!"}}]
["COD BECK/IRE","S10 F/V Test","2021-02-09","Tuesday","2021-01-04","Alex Haggarty",3,"North","Oakdale Upp & Low",null,{"$f":"VLOOKUP(A35,#REF!,2,FALSE)","v":{"$error":"#REF!"}},{"$f":"VLOOKUP(A35,#REF!,3,FALSE)","v":{"$error":"#REF!"}},{"$f":"VLOOKUP(A35,#REF!,4,FALSE)","v":{"$error":"#REF!"}},{"$f":"VLOOKUP(A35,#REF!,7,FALSE)","v":{"$error":"#REF!"}},{"$f":"VLOOKUP(A35,#REF!,5,FALSE)","v":{"$error":"#REF!"}}]
["REDMIRES LOWER/IRE","F/V Test","2021-02-11","Tuesday","2021-01-04","Tony Hartley",3,"South","Upp, Mid, Low",null,{"$f":"VLOOKUP(A36,#REF!,2,FALSE)","v":{"$error":"#REF!"}},{"$f":"VLOOKUP(A36,#REF!,3,FALSE)","v":{"$error":"#REF!"}},{"$f":"VLOOKUP(A36,#REF!,4,FALSE)","v":{"$error":"#REF!"}},{"$f":"VLOOKUP(A36,#REF!,7,FALSE)","v":{"$error":"#REF!"}},{"$f":"VLOOKUP(A36,#REF!,5,FALSE)","v":{"$error":"#REF!"}}]
["REDMIRES MIDDLE/IRE","F/V Test","2021-02-11","Tuesday","2021-01-04","Tony Hartley",3,"South","Upp, Mid, Low",null,{"$f":"VLOOKUP(A37,#REF!,2,FALSE)","v":{"$error":"#REF!"}},{"$f":"VLOOKUP(A37,#REF!,3,FALSE)","v":{"$error":"#REF!"}},{"$f":"VLOOKUP(A37,#REF!,4,FALSE)","v":{"$error":"#REF!"}},{"$f":"VLOOKUP(A37,#REF!,7,FALSE)","v":{"$error":"#REF!"}},{"$f":"VLOOKUP(A37,#REF!,5,FALSE)","v":{"$error":"#REF!"}}]
["REDMIRES UPPER/IRE","F/V Test","2021-02-11","Tuesday","2021-01-04","Tony Hartley",3,"South","Upp, Mid, Low",null,{"$f":"VLOOKUP(A38,#REF!,2,FALSE)","v":{"$error":"#REF!"}},{"$f":"VLOOKUP(A38,#REF!,3,FALSE)","v":{"$error":"#REF!"}},{"$f":"VLOOKUP(A38,#REF!,4,FALSE)","v":{"$error":"#REF!"}},{"$f":"VLOOKUP(A38,#REF!,7,FALSE)","v":{"$error":"#REF!"}},{"$f":"VLOOKUP(A38,#REF!,5,FALSE)","v":{"$error":"#REF!"}}]
["RIVELIN UPPER/IRE","F/V Test","2021-02-11","Thursday","2021-01-04","Tony Hartley",3,"South","Dep Pond",null,{"$f":"VLOOKUP(A39,#REF!,2,FALSE)","v":{"$error":"#REF!"}},{"$f":"VLOOKUP(A39,#REF!,3,FALSE)","v":{"$error":"#REF!"}},{"$f":"VLOOKUP(A39,#REF!,4,FALSE)","v":{"$error":"#REF!"}},{"$f":"VLOOKUP(A39,#REF!,7,FALSE)","v":{"$error":"#REF!"}},{"$f":"VLOOKUP(A39,#REF!,5,FALSE)","v":{"$error":"#REF!"}}]
["RIVELIN/DEP POND IRE","F/V Test","2021-02-11","Thursday","2021-01-04","Tony Hartley",3,"South","Upper",null,{"$f":"VLOOKUP(A40,#REF!,2,FALSE)","v":{"$error":"#REF!"}},{"$f":"VLOOKUP(A40,#REF!,3,FALSE)","v":{"$error":"#REF!"}},{"$f":"VLOOKUP(A40,#REF!,4,FALSE)","v":{"$error":"#REF!"}},{"$f":"VLOOKUP(A40,#REF!,7,FALSE)","v":{"$error":"#REF!"}},{"$f":"VLOOKUP(A40,#REF!,5,FALSE)","v":{"$error":"#REF!"}}]
{"$rows_left_out":237}